ПРАВЛЕНИЕ ОРГАНИЗАЦИИ
type: LexicalConcept
holonym: http://lod.ruthes.org/resource/concept/106560
hypernym: http://lod.ruthes.org/resource/concept/117042
hypernym: http://lod.ruthes.org/resource/concept/144524
meronym: http://lod.ruthes.org/resource/concept/149112
definition: руководящий орган в компании или учреждении.
in scheme: ruthes
lexicalized sense: 123565-правление-n-0
lexicalized sense: 123565-правление организации-ng-0
lexicalized sense: 123565-правленческий-adj-0