ПОУЧИТЕЛЬНЫЙ
type: LexicalConcept
holonym: http://lod.ruthes.org/resource/concept/133367
hypernym: http://lod.ruthes.org/resource/concept/119150
definition: такой, который учит чему-либо, дает ценные, полезные сведения
in scheme: ruthes
lexicalized sense: 123590-поучительность-n-0
lexicalized sense: 123590-поучительный-adj-0