ВОЛЬЕРА
type: LexicalConcept
holonym: http://lod.ruthes.org/resource/concept/4526
hypernym: http://lod.ruthes.org/resource/concept/111506
hypernym: http://lod.ruthes.org/resource/concept/123627
definition: участок, огороженная площадка (с навесом или открытая) с присоединяющимися к ней клетками или домиками для содержания мелких животных
in scheme: ruthes
lexicalized sense: 123626-вольер-n-0
lexicalized sense: 123626-вольера-n-0
lexicalized sense: 123626-вольерный-adj-0