СВИТА, СОПРОВОЖДАЮЩИЕ ЛИЦА
type: LexicalConcept
holonym: http://lod.ruthes.org/resource/concept/119747
hypernym: http://lod.ruthes.org/resource/concept/127272
definition: совокупность лиц, сопровождающих какую-либо важную, высокопоставленную особу
in scheme: ruthes
lexicalized sense: 123730-свита-n-0
lexicalized sense: 123730-свитский-adj-0
lexicalized sense: 123730-сопровождающие лица-ng-0