ПОСЛАНИЕ (ПИСЬМЕННОЕ ОБРАЩЕНИЕ ГОСУДАРСТВЕННОГО ДЕЯТЕЛЯ)
type: LexicalConcept
hypernym: http://lod.ruthes.org/resource/concept/106459
definition: официальное обращение государственного или общественного деятеля к другим официальным лицам или учреждениям в форме письма
in scheme: ruthes
lexicalized sense: 123813-послание-n-0