ТЕМПЕРАМЕНТ ЧЕЛОВЕКА
type: LexicalConcept
association1: http://lod.ruthes.org/resource/concept/106924
holonym: http://lod.ruthes.org/resource/concept/7789
hypernym: http://lod.ruthes.org/resource/concept/106768
definition: совокупность психических свойств человека, обусловленных типом высшей нервной деятельности и проявляющихся в поведении, в силе чувств, в отношении к окружающей действительности
in scheme: ruthes
lexicalized sense: 123934-темперамент-n-0
lexicalized sense: 123934-темперамент человека-ng-0