ФЮРЕР
type: LexicalConcept
holonym: http://lod.ruthes.org/resource/concept/3144
hypernym: http://lod.ruthes.org/resource/concept/7977
definition: титул Адольфа Гитлера как руководителя государства фашистской Германии
in scheme: ruthes
lexicalized sense: 123992-фюрер-n-0
lexicalized sense: 123992-фюрерский-n-0