КАНОНИР
type: LexicalConcept
hypernym: http://lod.ruthes.org/resource/concept/113399
definition: пушкарь, рядовой в артиллерии (в российской армии до 1917 г. и некоторых других армиях)
in scheme: ruthes
lexicalized sense: 124355-канонир-n-0
lexicalized sense: 124355-канонирский-adj-0