ЗАСТОЛЬНЫЙ ТОСТ
type: LexicalConcept
holonym: http://lod.ruthes.org/resource/concept/128571
hypernym: http://lod.ruthes.org/resource/concept/147233
definition: короткая застольная речь, пожелание кому-либо чего-либо; здравица
in scheme: ruthes
lexicalized sense: 124614-застольный тост-ng-0
lexicalized sense: 124614-тост-n-0