ДИСЦИПЛИНИРОВАННЫЙ
type: LexicalConcept
association1: http://lod.ruthes.org/resource/concept/106984
association2: http://lod.ruthes.org/resource/concept/128590
association2: http://lod.ruthes.org/resource/concept/130854
hypernym: http://lod.ruthes.org/resource/concept/106924
hyponym: http://lod.ruthes.org/resource/concept/133976
definition: психологическое свойство личности, связанное с соблюдением правил и законов, установленных в обществе
in scheme: ruthes
lexicalized sense: 124629-дисциплинированность-n-0
lexicalized sense: 124629-дисциплинированный-adj-0
lexicalized sense: 124629-организованность-n-0
lexicalized sense: 124629-организованный-adj-0