ФАНАТИК
type: LexicalConcept
holonym: http://lod.ruthes.org/resource/concept/129444
hypernym: http://lod.ruthes.org/resource/concept/107524
hypernym: http://lod.ruthes.org/resource/concept/127065
meronym: http://lod.ruthes.org/resource/concept/119887
definition: человек, отличающийся исступлённой религиозностью, крайней нетерпимостью к другим верованиям
in scheme: ruthes
lexicalized sense: 124757-исступленный фанатик-ng-0
lexicalized sense: 124757-фанатик-n-0
lexicalized sense: 124757-фанатичка-n-0