ИРРАЦИОНАЛЬНОЕ ЧИСЛО
type: LexicalConcept
hypernym: http://lod.ruthes.org/resource/concept/113306
definition: несоизмеримость с единицей, целым или дробным числом
in scheme: ruthes
lexicalized sense: 124760-иррациональная величина-ng-0
lexicalized sense: 124760-иррациональное число-ng-0
lexicalized sense: 124760-иррациональность-n-0
lexicalized sense: 124760-иррациональный-adj-0