ПОНЯТИЕ, КОНЦЕПТ
type: LexicalConcept
hypernym: http://lod.ruthes.org/resource/concept/143290
hyponym: http://lod.ruthes.org/resource/concept/106464
hyponym: http://lod.ruthes.org/resource/concept/124900
hyponym: http://lod.ruthes.org/resource/concept/125061
hyponym: http://lod.ruthes.org/resource/concept/142485
definition: логически расчленённая общая мысль о предмете, включающая ряд взаимосвязанных признаков
in scheme: ruthes
lexicalized sense: 124901-концепт-n-0
lexicalized sense: 124901-концептуальный-adj-0
lexicalized sense: 124901-понятие-n-0
lexicalized sense: 124901-понятийный-adj-0