АДЖАРЦЫ
type: LexicalConcept
association2: http://lod.ruthes.org/resource/concept/100755
hypernym: http://lod.ruthes.org/resource/concept/133035
hypernym: http://lod.ruthes.org/resource/concept/139862
definition: представительница народа, населяющего Аджарию, выходец из Аджарии или потомок таких выходцев.
in scheme: ruthes
lexicalized sense: 124950-аджарец-n-0
lexicalized sense: 124950-аджарка-n-0