АЛЬМА-МАТЕР
type: LexicalConcept
hypernym: http://lod.ruthes.org/resource/concept/1618
hypernym: http://lod.ruthes.org/resource/concept/764
meronym: http://lod.ruthes.org/resource/concept/124986
definition: высшее учебное заведение, законченное лицом, про которого идёт речь
in scheme: ruthes
lexicalized sense: 124985-альма-матер-n-0