ЛИЦЕЙ
type: LexicalConcept
hypernym: http://lod.ruthes.org/resource/concept/129968
meronym: http://lod.ruthes.org/resource/concept/124616
definition: в ряде стран-cреднее общеобразовательное, реже специализированное учебное заведение (в отдельных случаях охватывающее также программу обучения высшей школы)
in scheme: ruthes
lexicalized sense: 125-лицей-n-0
lexicalized sense: 125-лицейский-adj-0