ПРИТЯЗАНИЕ (СТРЕМЛЕНИЕ ПОЛУЧИТЬ ЧТО-Н.)
type: LexicalConcept
holonym: http://lod.ruthes.org/resource/concept/121329
hypernym: http://lod.ruthes.org/resource/concept/106476
hyponym: http://lod.ruthes.org/resource/concept/125005
definition: стремление добиться чьего-либо признания, одобрения
in scheme: ruthes
lexicalized sense: 125004-притязание-n-0