СПОРТИВНАЯ АРЕНА
type: LexicalConcept
association2: http://lod.ruthes.org/resource/concept/148495
holonym: http://lod.ruthes.org/resource/concept/3240
hypernym: http://lod.ruthes.org/resource/concept/148887
definition: место проведения спортивных соревнований
in scheme: ruthes
lexicalized sense: 125057-арена-n-0
lexicalized sense: 125057-арена стадиона-ng-0
lexicalized sense: 125057-аренный-adj-0
lexicalized sense: 125057-спортивная арена-ng-0