СУБЪЕКТ СУЖДЕНИЯ
type: LexicalConcept
holonym: http://lod.ruthes.org/resource/concept/125060
hypernym: http://lod.ruthes.org/resource/concept/106645
hypernym: http://lod.ruthes.org/resource/concept/124901
definition: предмет суждения, который определяется и раскрывается в своем содержании предикатом
in scheme: ruthes
lexicalized sense: 125061-субъект-n-0
lexicalized sense: 125061-субъект суждения-ng-0
lexicalized sense: 125061-субъектный-adj-0