ПЕРЕМЕННАЯ ВЕЛИЧИНА
type: LexicalConcept
hypernym: http://lod.ruthes.org/resource/concept/106515
hyponym: http://lod.ruthes.org/resource/concept/125064
definition: поименованная величина, способная принимать различные числовые значения
in scheme: ruthes
lexicalized sense: 125063-переменная-n-0
lexicalized sense: 125063-переменная величина-ng-0