АРИСТОКРАТ (ДВОРЯНИН)
type: LexicalConcept
holonym: http://lod.ruthes.org/resource/concept/124731
hypernym: http://lod.ruthes.org/resource/concept/110641
hyponym: http://lod.ruthes.org/resource/concept/127463
definition: представитель аристократии; человек, принадлежащий к высшему слою родовой знати
in scheme: ruthes
lexicalized sense: 125065-аристократ-n-0
lexicalized sense: 125065-аристократка-n-0
lexicalized sense: 125065-аристократский-adj-0
lexicalized sense: 125065-знатная особа-ng-0