АТЕИСТ (ПОСЛЕДОВАТЕЛЬ АТЕИЗМА)
type: LexicalConcept
holonym: http://lod.ruthes.org/resource/concept/4400
hypernym: http://lod.ruthes.org/resource/concept/107524
definition: сторонник атеизма; человек отрицающий существование Бога, богов, или любой другой высшей сущности, управляющей миром
in scheme: ruthes
lexicalized sense: 125088-атеист-n-0
lexicalized sense: 125088-атеистка-n-0
lexicalized sense: 125088-атеистский-adj-0
lexicalized sense: 125088-безбожник-n-0
lexicalized sense: 125088-безбожница-n-0
lexicalized sense: 125088-безбожнический-adj-0
lexicalized sense: 125088-неверующая-n-0
lexicalized sense: 125088-неверующий-adj-0
lexicalized sense: 125088-последователь атеизма-ng-0