БАНДИТ, ВООРУЖЕННЫЙ ГРАБИТЕЛЬ
type: LexicalConcept
holonym: http://lod.ruthes.org/resource/concept/7322
hypernym: http://lod.ruthes.org/resource/concept/115324
definition: член преступной группировки, вооружённый грабитель или убийца
in scheme: ruthes
lexicalized sense: 125152-бандит-n-0
lexicalized sense: 125152-бандитка-n-0
lexicalized sense: 125152-бандитский-adj-0
lexicalized sense: 125152-бандюга-n-0
lexicalized sense: 125152-бандюган-n-0
lexicalized sense: 125152-вооруженный бандит-ng-0
lexicalized sense: 125152-вооруженный преступник-ng-0
lexicalized sense: 125152-гангстер-n-0
lexicalized sense: 125152-гангстерский-adj-0
lexicalized sense: 125152-гангстерша-n-0
lexicalized sense: 125152-головорез-n-0
lexicalized sense: 125152-участник банды-ng-0
lexicalized sense: 125152-член банды-ng-0