БЕЗЗАЩИТНЫЙ, НЕСПОСОБНЫЙ ЗАЩИТИТЬ СЕБЯ
type: LexicalConcept
hypernym: http://lod.ruthes.org/resource/concept/125365
definition: не могущий самостоятельно охранить, защитить себя, лишённый средств самозащиты, лишённый защиты
in scheme: ruthes
lexicalized sense: 125207-беззащитность-n-0
lexicalized sense: 125207-беззащитный-adj-0
lexicalized sense: 125207-неспособный защитить себя-adjg-0