БЕЗГРАНИЧНЫЙ, БЕЗМЕРНЫЙ
type: LexicalConcept
hypernym: http://lod.ruthes.org/resource/concept/125209
definition: не ограниченный в возможностях, в развитии; беспредельный
in scheme: ruthes
lexicalized sense: 125210-безграничность-n-0
lexicalized sense: 125210-безграничный-adj-0
lexicalized sense: 125210-безмерность-n-0
lexicalized sense: 125210-безмерный-adj-0
lexicalized sense: 125210-беспредельность-n-0
lexicalized sense: 125210-беспредельный-adj-0