ЖЕЛАННЫЙ
type: LexicalConcept
holonym: http://lod.ruthes.org/resource/concept/106476
holonym: http://lod.ruthes.org/resource/concept/118770
hypernym: http://lod.ruthes.org/resource/concept/114651
hyponym: http://lod.ruthes.org/resource/concept/125683
definition: такой, которого желают, к которому стремятся
in scheme: ruthes
lexicalized sense: 125682-желанность-n-0
lexicalized sense: 125682-желанный-adj-0