ВОСПРИИМЧИВЫЙ
type: LexicalConcept
association1: http://lod.ruthes.org/resource/concept/106915
hypernym: http://lod.ruthes.org/resource/concept/106924
hyponym: http://lod.ruthes.org/resource/concept/117867
hyponym: http://lod.ruthes.org/resource/concept/119904
definition: способность воспринимать, усваивать что-либо
in scheme: ruthes
lexicalized sense: 125739-восприимчивость-n-0
lexicalized sense: 125739-восприимчивый-adj-0