ВПЕЧАТЛЕНИЕ ОТ ПЕРЕЖИТОГО
type: LexicalConcept
association2: http://lod.ruthes.org/resource/concept/125744
hypernym: http://lod.ruthes.org/resource/concept/106651
hypernym: http://lod.ruthes.org/resource/concept/111380
hyponym: http://lod.ruthes.org/resource/concept/135706
hyponym: http://lod.ruthes.org/resource/concept/138455
hyponym: http://lod.ruthes.org/resource/concept/149366
definition: ощущаемый след, оставленный в сознании, эмоциях чем-либо
in scheme: ruthes
lexicalized sense: 125745-впечатление-n-0
lexicalized sense: 125745-впечатление в душе-ng-0
lexicalized sense: 125745-впечатление от пережитого-ng-0