ГЕНИАЛЬНЫЙ (ОДАРЕННЫЙ)
type: LexicalConcept
association1: http://lod.ruthes.org/resource/concept/155115
hypernym: http://lod.ruthes.org/resource/concept/106767
hypernym: http://lod.ruthes.org/resource/concept/125551
definition: о человеке обладающий выдающимися способностями, незаурядным умом и талантом, в высшей степени одарённый
in scheme: ruthes
lexicalized sense: 125866-гениальность-n-0
lexicalized sense: 125866-гениальный-adj-0
lexicalized sense: 125866-сверходаренный-adj-0
lexicalized sense: 125866-суперталантливый-adj-0