БЕДНЯК, НЕИМУЩИЙ ЧЕЛОВЕК
type: LexicalConcept
association1: http://lod.ruthes.org/resource/concept/5986
association2: http://lod.ruthes.org/resource/concept/116838
association2: http://lod.ruthes.org/resource/concept/125922
association2: http://lod.ruthes.org/resource/concept/129324
association2: http://lod.ruthes.org/resource/concept/140073
holonym: http://lod.ruthes.org/resource/concept/593
hypernym: http://lod.ruthes.org/resource/concept/2149
hyponym: http://lod.ruthes.org/resource/concept/127170
hyponym: http://lod.ruthes.org/resource/concept/4350
definition: человек низшего слоя общества; нищий, бедняк
in scheme: ruthes
lexicalized sense: 125921-бедняк-n-0
lexicalized sense: 125921-бедняцкий-adj-0
lexicalized sense: 125921-голодранец-n-0
lexicalized sense: 125921-неимущий человек-ng-0
lexicalized sense: 125921-нищеброд-n-0
lexicalized sense: 125921-нищебродский-n-0