ГОРЕЧЬ, ГОРЬКОЕ ЧУВСТВО
type: LexicalConcept
association1: http://lod.ruthes.org/resource/concept/106806
hypernym: http://lod.ruthes.org/resource/concept/106651
definition: тягостное, гнетущее чувство, вызываемое разочарованием, обидой, неудачей и&
in scheme: ruthes
lexicalized sense: 125932-горечь-n-0
lexicalized sense: 125932-горечь воспоминаний-ng-0
lexicalized sense: 125932-горчинка-n-0
lexicalized sense: 125932-горькое чувство-ng-0