ГЯУР (ИНОВЕРЕЦ)
type: LexicalConcept
association2: http://lod.ruthes.org/resource/concept/111912
holonym: http://lod.ruthes.org/resource/concept/1128
hypernym: http://lod.ruthes.org/resource/concept/125978
definition: тот, кто исповедует иную, не истинную веру
in scheme: ruthes
lexicalized sense: 125979-гяур-n-0
lexicalized sense: 125979-гяурский-adj-0
lexicalized sense: 125979-неверный-adj-0