ДЕМАГОГИЯ (ПУСТОСЛОВИЕ)
type: LexicalConcept
holonym: http://lod.ruthes.org/resource/concept/6646
hypernym: http://lod.ruthes.org/resource/concept/125031
hyponym: http://lod.ruthes.org/resource/concept/136545
meronym: http://lod.ruthes.org/resource/concept/130778
definition: высокопарные рассуждения, пустая болтовня, прикрывающие какие-либо корыстные цели
in scheme: ruthes
lexicalized sense: 126027-демагогический-adj-0
lexicalized sense: 126027-демагогичность-n-0
lexicalized sense: 126027-демагогичный-adj-0
lexicalized sense: 126027-демагогия-n-0
lexicalized sense: 126027-демагогствовать-n-0