КОЛЛЕКТИВ
type: LexicalConcept
hypernym: http://lod.ruthes.org/resource/concept/106627
hyponym: http://lod.ruthes.org/resource/concept/121726
hyponym: http://lod.ruthes.org/resource/concept/123639
hyponym: http://lod.ruthes.org/resource/concept/126484
hyponym: http://lod.ruthes.org/resource/concept/6067
hyponym: http://lod.ruthes.org/resource/concept/7011
hyponym: http://lod.ruthes.org/resource/concept/7100
hyponym: http://lod.ruthes.org/resource/concept/7252
hyponym: http://lod.ruthes.org/resource/concept/7634
hyponym: http://lod.ruthes.org/resource/concept/8132
hyponym: http://lod.ruthes.org/resource/concept/879
meronym: http://lod.ruthes.org/resource/concept/107494
meronym: http://lod.ruthes.org/resource/concept/129210
definition: группа людей, объединённых общей деятельностью.
in scheme: ruthes
lexicalized sense: 126483-коллектив-n-0
lexicalized sense: 126483-коллектив людей-ng-0
lexicalized sense: 126483-коллективный-adj-0