КОНЦЕНТРАЦИЯ ВЕЩЕСТВА
type: LexicalConcept
association2: http://lod.ruthes.org/resource/concept/139819
hypernym: http://lod.ruthes.org/resource/concept/106841
definition: характеристика плотности, количества чего-либо в определённой области пространства, как правило, по отношению к иным веществам, предметам, объектам
in scheme: ruthes
lexicalized sense: 126505-концентрация-n-0
lexicalized sense: 126505-концентрация вещества-ng-0