САМОСУД
type: LexicalConcept
hypernym: http://lod.ruthes.org/resource/concept/126627
hypernym: http://lod.ruthes.org/resource/concept/134174
hyponym: http://lod.ruthes.org/resource/concept/126629
definition: расправа без суда и следствия с человеком, уличённым или заподозренным в преступлении
in scheme: ruthes
lexicalized sense: 126628-самосуд-n-0
lexicalized sense: 126628-самосудный-adj-0
lexicalized sense: 126628-самочинная расправа-ng-0