ТРОЙКА (УЧЕБНАЯ ОТМЕТКА)
type: LexicalConcept
association2: http://lod.ruthes.org/resource/concept/125770
hypernym: http://lod.ruthes.org/resource/concept/113429
definition: в учебных заведениях — оценка в три балла, удовлетворительно
in scheme: ruthes
lexicalized sense: 126798-оценка три-ng-0
lexicalized sense: 126798-тройка-n-0