МЕДИЦИНСКИЙ ИНСТРУМЕНТ
type: LexicalConcept
hypernym: http://lod.ruthes.org/resource/concept/2977
hyponym: http://lod.ruthes.org/resource/concept/111721
hyponym: http://lod.ruthes.org/resource/concept/126892
hyponym: http://lod.ruthes.org/resource/concept/136990
hyponym: http://lod.ruthes.org/resource/concept/137125
hyponym: http://lod.ruthes.org/resource/concept/139201
hyponym: http://lod.ruthes.org/resource/concept/146880
hyponym: http://lod.ruthes.org/resource/concept/4797
hyponym: http://lod.ruthes.org/resource/concept/9804
definition: техническое устройство, предназначенное для выполнения профилактических, диагностических, лечебных, исследовательских манипуляций и процедур, удерживаемое в руке и приводимое в действие мышечной силой человека или являющееся сменным рабочим органом медицинского аппарата (машины)
in scheme: ruthes
lexicalized sense: 126891-инструмент медицинский-ng-0
lexicalized sense: 126891-медико-инструментальный-adj-0
lexicalized sense: 126891-мединструмент-n-0
lexicalized sense: 126891-медицинский инструмент-ng-0
lexicalized sense: 126891-медицинский инструментарий-ng-0