КОНСЕРВАТИЗМ, КОНСЕРВАТИВНЫЕ УБЕЖДЕНИЯ
type: LexicalConcept
association1: http://lod.ruthes.org/resource/concept/107475
association2: http://lod.ruthes.org/resource/concept/145607
hypernym: http://lod.ruthes.org/resource/concept/106470
hyponym: http://lod.ruthes.org/resource/concept/138435
hyponym: http://lod.ruthes.org/resource/concept/139099
hyponym: http://lod.ruthes.org/resource/concept/139760
meronym: http://lod.ruthes.org/resource/concept/127024
definition: приверженность ко всему старому, традиционному, консервативные убеждения
in scheme: ruthes
lexicalized sense: 127023-консервативность-n-0
lexicalized sense: 127023-консервативные взгляды-ng-0
lexicalized sense: 127023-консервативные убеждения-ng-0
lexicalized sense: 127023-консервативный-adj-0
lexicalized sense: 127023-консерватизм-n-0