ЭКСТРЕМИСТ (СТОРОННИК ЭКСТРЕМИЗМА)
type: LexicalConcept
holonym: http://lod.ruthes.org/resource/concept/127066
hypernym: http://lod.ruthes.org/resource/concept/128582
hyponym: http://lod.ruthes.org/resource/concept/113609
hyponym: http://lod.ruthes.org/resource/concept/124757
hyponym: http://lod.ruthes.org/resource/concept/127064
hyponym: http://lod.ruthes.org/resource/concept/140354
definition: сторонник экстремизма, приверженец крайних взглядов и мер
in scheme: ruthes
lexicalized sense: 127065-ультрарадикал-n-0
lexicalized sense: 127065-экстремист-n-0
lexicalized sense: 127065-экстремистка-n-0