НЕВЕЖЛИВЫЙ, НЕУЧТИВЫЙ
type: LexicalConcept
association: http://lod.ruthes.org/resource/concept/118023
hypernym: http://lod.ruthes.org/resource/concept/136267
hyponym: http://lod.ruthes.org/resource/concept/119358
hyponym: http://lod.ruthes.org/resource/concept/125977
definition: выражающий, заключающий в себе неучтивость, невоспитанность, грубость
in scheme: ruthes
lexicalized sense: 127126-невежливость-n-0
lexicalized sense: 127126-невежливый-adj-0
lexicalized sense: 127126-некорректность-n-0
lexicalized sense: 127126-некорректный-adj-0
lexicalized sense: 127126-неучтивость-n-0
lexicalized sense: 127126-неучтивый-adj-0