РАБСТВО, ПОЛОЖЕНИЕ РАБА
type: LexicalConcept
association2: http://lod.ruthes.org/resource/concept/126382
association2: http://lod.ruthes.org/resource/concept/136822
hypernym: http://lod.ruthes.org/resource/concept/127129
hypernym: http://lod.ruthes.org/resource/concept/2081
meronym: http://lod.ruthes.org/resource/concept/126384
definition: состояние раба, бесправное положение, полная зависимость от другого человека, подчинённость другому человеку
in scheme: ruthes
lexicalized sense: 127130-невольнический-adj-0
lexicalized sense: 127130-невольничество-n-0
lexicalized sense: 127130-положение раба-ng-0
lexicalized sense: 127130-рабство-n-0