НЕЗАМЕТНЫЙ НА ВЗГЛЯД
type: LexicalConcept
association: http://lod.ruthes.org/resource/concept/125615
association2: http://lod.ruthes.org/resource/concept/118552
association2: http://lod.ruthes.org/resource/concept/129104
association2: http://lod.ruthes.org/resource/concept/129105
association2: http://lod.ruthes.org/resource/concept/132762
association2: http://lod.ruthes.org/resource/concept/141505
hypernym: http://lod.ruthes.org/resource/concept/123474
hypernym: http://lod.ruthes.org/resource/concept/153619
definition: такой, что трудно приметить, увидеть, незаметный
in scheme: ruthes
lexicalized sense: 127137-малозаметность-n-0
lexicalized sense: 127137-малозаметный-adj-0
lexicalized sense: 127137-малоприметный-adj-0
lexicalized sense: 127137-невидимый-adj-0
lexicalized sense: 127137-недоступный для зрения-adjg-0
lexicalized sense: 127137-недоступный зрению-adjg-0
lexicalized sense: 127137-незаметность-n-0
lexicalized sense: 127137-незаметный-adj-0
lexicalized sense: 127137-незаметный для взгляда-adjg-0
lexicalized sense: 127137-незаметный для глаз-adjg-0
lexicalized sense: 127137-незаметный на взгляд-adjg-0
lexicalized sense: 127137-незримость-n-0
lexicalized sense: 127137-незримый-adj-0
lexicalized sense: 127137-неприметность-n-0
lexicalized sense: 127137-неприметный-adj-0