ЛЮКС (ЕДИНИЦА ОСВЕЩЕННОСТИ)
type: LexicalConcept
hypernym: http://lod.ruthes.org/resource/concept/138644
definition: единица измерения освещённости в системе СИ
in scheme: ruthes
lexicalized sense: 127303-люкс-n-0