РЫЦАРЬ-ФЕОДАЛ
type: LexicalConcept
association2: http://lod.ruthes.org/resource/concept/147546
holonym: http://lod.ruthes.org/resource/concept/122041
hypernym: http://lod.ruthes.org/resource/concept/121230
hypernym: http://lod.ruthes.org/resource/concept/127439
hyponym: http://lod.ruthes.org/resource/concept/134811
definition: в средневековой Европе — тяжеловооружённый всадник, феодал, состоящий в зависимости от сюзерена
in scheme: ruthes
lexicalized sense: 127437-рыцарский-adj-0
lexicalized sense: 127437-рыцарство-n-0
lexicalized sense: 127437-рыцарь-n-0