ПОГРОМЩИК
type: LexicalConcept
holonym: http://lod.ruthes.org/resource/concept/127583
hypernym: http://lod.ruthes.org/resource/concept/106857
hypernym: http://lod.ruthes.org/resource/concept/2149
definition: участник погромов, грабежей, убийств и т.п.
in scheme: ruthes
lexicalized sense: 127584-громила-n-0
lexicalized sense: 127584-погромщик-n-0
lexicalized sense: 127584-погромщица-n-0
lexicalized sense: 127584-участник погрома-ng-0