НЕЧЕТКИЙ, НЕОТЧЕТЛИВЫЙ
type: LexicalConcept
association: http://lod.ruthes.org/resource/concept/119007
hypernym: http://lod.ruthes.org/resource/concept/151360
hyponym: http://lod.ruthes.org/resource/concept/119536
hyponym: http://lod.ruthes.org/resource/concept/119837
hyponym: http://lod.ruthes.org/resource/concept/120110
hyponym: http://lod.ruthes.org/resource/concept/124742
hyponym: http://lod.ruthes.org/resource/concept/138069
definition: такой, который трудно разглядеть; неотчетливо видимый
in scheme: ruthes
lexicalized sense: 128660-неотчетливость-n-0
lexicalized sense: 128660-неотчетливый-adj-0
lexicalized sense: 128660-нечеткий-adj-0
lexicalized sense: 128660-нечетко очерченный-adjg-0
lexicalized sense: 128660-нечеткость-n-0
lexicalized sense: 128660-неясность-n-0
lexicalized sense: 128660-неясный-adj-0
lexicalized sense: 128660-стертость-n-0
lexicalized sense: 128660-стертый-adj-0