РЕЧЬ, ДАР РЕЧИ
type: LexicalConcept
association1: http://lod.ruthes.org/resource/concept/123928
association2: http://lod.ruthes.org/resource/concept/132930
association2: http://lod.ruthes.org/resource/concept/133856
holonym: http://lod.ruthes.org/resource/concept/2149
hypernym: http://lod.ruthes.org/resource/concept/106766
hyponym: http://lod.ruthes.org/resource/concept/128929
definition: способность использовать естественный язык, то есть говорить или писать
in scheme: ruthes
lexicalized sense: 128928-дар речи-ng-0
lexicalized sense: 128928-дар слова-ng-0
lexicalized sense: 128928-речевой-adj-0
lexicalized sense: 128928-речь-n-0
lexicalized sense: 128928-способность говорить-ng-0