УЗАКОНИТЬ
type: LexicalConcept
association1: http://lod.ruthes.org/resource/concept/3673
holonym: http://lod.ruthes.org/resource/concept/422
hypernym: http://lod.ruthes.org/resource/concept/139154
hyponym: http://lod.ruthes.org/resource/concept/124108
definition: делать (сделать), признавать (признать) легитимным, законным, правомерным; узаконивать (узаконить)
in scheme: ruthes
lexicalized sense: 129343-легитимация-n-0
lexicalized sense: 129343-легитимизировать-v-0
lexicalized sense: 129343-узаконение-n-0
lexicalized sense: 129343-узаконивание-n-0
lexicalized sense: 129343-узаконивать-v-0
lexicalized sense: 129343-узаконить-v-0
lexicalized sense: 129343-установить в соответствии с законодательством-vg-0