НЕЗАКОННОЕ КОПИРОВАНИЕ
type: LexicalConcept
hypernym: http://lod.ruthes.org/resource/concept/140758
hypernym: http://lod.ruthes.org/resource/concept/5893
hypernym: http://lod.ruthes.org/resource/concept/7652
meronym: http://lod.ruthes.org/resource/concept/141692
meronym: http://lod.ruthes.org/resource/concept/7728
definition: нарушать авторские права, незаконно используя чужую интеллектуальную собственность
in scheme: ruthes
lexicalized sense: 129442-незаконное копирование-ng-0
lexicalized sense: 129442-пиратский-adj-0
lexicalized sense: 129442-пиратское копирование-ng-0
lexicalized sense: 129442-пиратство-n-0
lexicalized sense: 129442-пиратствовать-v-0